Target
Neprilysin
Ligand
BDBM50085460
Substrate
Meas. Tech.
ChEBML_144612
IC50
1.8±n/a nM
Citation
 Robl, JASimpkins, LMAsaad, MM N-formyl hydroxylamine containing dipeptides: generation of a new class of vasopeptidase inhibitors. Bioorg Med Chem Lett 10:257-60 (2000)  
Target
Name:
Neprilysin
Synonyms:
Mme Neprilysin Neutral endopeptidase 24.11
Type:
Protein
Mol. Mass.:
85789.59
Organism:
Rattus norvegicus (Rat)
Description:
P07861
Residue:
750
  
Inhibitor
Name:
BDBM50085460
Synonyms:
(4S,7S,12bR)-7-[(R)-2-Benzyl-3-(formyl-hydroxy-amino)-propionylamino]-6-oxo-1,2,3,4,6,7,8,12b-octahydro-benzo[c]pyrido[1,2-a]azepine-4-carboxylic acid | CHEMBL177551
Type:
Small organic molecule
Emp. Form.:
C26H29N3O6
Mol. Mass.:
479.525
SMILES:
ON(C[C@@H](Cc1ccccc1)C(=O)N[C@H]1Cc2ccccc2[C@H]2CCC[C@H](N2C1=O)C(O)=O)C=O
: