Target
Tyrosine-protein kinase TXK
Ligand
BDBM250082
Substrate
Meas. Tech.
ChEMBL_1912341 (CHEMBL4414924)
IC50
3.0±n/a nM
Citation
 Guo, YLiu, YHu, NYu, DZhou, CShi, GZhang, BWei, MLiu, JLuo, LTang, ZSong, HGuo, YLiu, XSu, DZhang, SSong, XZhou, XHong, YChen, SCheng, ZYoung, SWei, QWang, HWang, QLv, LWang, FXu, HSun, HXing, HLi, NZhang, WWang, ZLiu, GSun, ZZhou, DLi, WLiu, LWang, LWang, Z Discovery of Zanubrutinib (BGB-3111), a Novel, Potent, and Selective Covalent Inhibitor of Bruton's Tyrosine Kinase. J Med Chem 62:7923-7940 (2019)  
Target
Name:
Tyrosine-protein kinase TXK
Synonyms:
PTK4 RLK TXK Tyrosine-protein kinase TXK (TXK)
Type:
Protein
Mol. Mass.:
61268.80
Organism:
Homo sapiens (Human)
Description:
P42681
Residue:
527
  
Inhibitor
Name:
BDBM250082
Synonyms:
US9447106, 27b (peak 2) | US9556188, Compound 27a
Type:
Small organic molecule
Emp. Form.:
C27H29N5O3
Mol. Mass.:
471.5509
SMILES:
NC(=O)c1c2NCC[C@@H](C3CCN(CC3)C(=O)C=C)n2nc1-c1ccc(Oc2ccccc2)cc1
: