Target
Translocator protein
Ligand
BDBM50408728
Substrate
Meas. Tech.
ChEMBL_1912567 (CHEMBL4415150)
Ki
1.6±n/a nM
Citation
 Vanda, DZajdel, PSoural, M Imidazopyridine-based selective and multifunctional ligands of biological targets associated with psychiatric and neurodegenerative diseases. Eur J Med Chem 181:0 (2019)  
Target
Name:
Translocator protein
Synonyms:
BZRP Mitochondrial benzodiazepine receptor PKBS Peripheral-type benzodiazepine receptor TSPO_HUMAN
Type:
Enzyme
Mol. Mass.:
18834.74
Organism:
Homo sapiens (Human)
Description:
P30536
Residue:
169
  
Inhibitor
Name:
BDBM50408728
Synonyms:
CHEMBL339816
Type:
Small organic molecule
Emp. Form.:
C21H25ClN4O
Mol. Mass.:
384.902
SMILES:
CCCN(CCC)C(=O)Cc1c(nc2c(N)cccn12)-c1ccc(Cl)cc1
: