Target
Translocator protein
Ligand
BDBM50274351
Substrate
Meas. Tech.
ChEMBL_1912567 (CHEMBL4415150)
Ki
0.150000±n/a nM
Citation
 Vanda, DZajdel, PSoural, M Imidazopyridine-based selective and multifunctional ligands of biological targets associated with psychiatric and neurodegenerative diseases. Eur J Med Chem 181:0 (2019)  
Target
Name:
Translocator protein
Synonyms:
BZRP Mitochondrial benzodiazepine receptor PKBS Peripheral-type benzodiazepine receptor TSPO_HUMAN
Type:
Enzyme
Mol. Mass.:
18834.74
Organism:
Homo sapiens (Human)
Description:
P30536
Residue:
169
  
Inhibitor
Name:
BDBM50274351
Synonyms:
2-(6,8-Dichloro-2-(4-nitrophenyl)imidazo[1,2-a]pyridin-3-yl)-N,N-dipropylacetamide | CHEMBL520465
Type:
Small organic molecule
Emp. Form.:
C21H22Cl2N4O3
Mol. Mass.:
449.33
SMILES:
CCCN(CCC)C(=O)Cc1c(nc2c(Cl)cc(Cl)cn12)-c1ccc(cc1)[N+]([O-])=O
: