Target
Translocator protein
Ligand
BDBM50274259
Substrate
Meas. Tech.
ChEMBL_1912567 (CHEMBL4415150)
Ki
0.882000±n/a nM
Citation
 Vanda, DZajdel, PSoural, M Imidazopyridine-based selective and multifunctional ligands of biological targets associated with psychiatric and neurodegenerative diseases. Eur J Med Chem 181:0 (2019)  
Target
Name:
Translocator protein
Synonyms:
BZRP Mitochondrial benzodiazepine receptor PKBS Peripheral-type benzodiazepine receptor TSPO_HUMAN
Type:
Enzyme
Mol. Mass.:
18834.74
Organism:
Homo sapiens (Human)
Description:
P30536
Residue:
169
  
Inhibitor
Name:
BDBM50274259
Synonyms:
CHEMBL521186 | N-Butyl-2-(6,8-dichloro-2-(4-methoxyphenyl)imidazo[1,2-a]pyridin-3-yl)-N-methylacetamide
Type:
Small organic molecule
Emp. Form.:
C21H23Cl2N3O2
Mol. Mass.:
420.332
SMILES:
CCCCN(C)C(=O)Cc1c(nc2c(Cl)cc(Cl)cn12)-c1ccc(OC)cc1
: