Target
Alpha-2A adrenergic receptor
Ligand
BDBM50085677
Substrate
Meas. Tech.
ChEMBL_33079 (CHEMBL647726)
Ki
25±n/a nM
Citation
 Ross, TMJetter, MCMcDonnell, MEBoyd, REConnelly, CDMartinez, RPLewis, MACodd, EERaffa, RBReitz, AB alpha(2) Adrenoceptor agonists as potential analgesic agents. 2. Discovery of 4-(4-Imidazo)-1,3-dimethyl-6,7-dihydrothianaphthene [corrected] as a high-affinity ligand for the alpha(2D) adrenergic receptor. J Med Chem 43:765-8 (2000)  
Target
Name:
Alpha-2A adrenergic receptor
Synonyms:
ADA2A_HUMAN ADRA2R Adrenergic alpha2A Alpha-2 adrenergic receptor subtype C10 Alpha-2A adrenoreceptor alpha-2A adrenergic receptor [Homo sapiens]
Type:
Enzyme
Mol. Mass.:
48979.91
Organism:
Homo sapiens (Human)
Description:
P08913
Residue:
450
  
Inhibitor
Name:
BDBM50085677
Synonyms:
4-(1,3-Dimethyl-6,7-dihydro-benzo[c]thiophen-4-yl)-1H-imidazole | CHEMBL284795
Type:
Small organic molecule
Emp. Form.:
C13H14N2S
Mol. Mass.:
230.329
SMILES:
Cc1sc(C)c2c1CCC=C2c1cnc[nH]1
: