Target
Alpha-2A adrenergic receptor [16-465]
Ligand
BDBM50085680
Substrate
Meas. Tech.
ChEMBL_33680 (CHEMBL646821)
Ki
1.5±n/a nM
Citation
 Ross, TMJetter, MCMcDonnell, MEBoyd, REConnelly, CDMartinez, RPLewis, MACodd, EERaffa, RBReitz, AB alpha(2) Adrenoceptor agonists as potential analgesic agents. 2. Discovery of 4-(4-Imidazo)-1,3-dimethyl-6,7-dihydrothianaphthene [corrected] as a high-affinity ligand for the alpha(2D) adrenergic receptor. J Med Chem 43:765-8 (2000)  
Target
Name:
Alpha-2A adrenergic receptor [16-465]
Synonyms:
ADA2A_RAT Adrenaline 2 Alpha-2A adrenoceptor Alpha-2AAR Alpha2 Adrenoreceptor adrenergic Alpha2A
Type:
G-protein coupled receptor
Mol. Mass.:
48961.69
Organism:
Rattus norvegicus (rat)
Description:
P22909[16-465]
Residue:
450
  
Inhibitor
Name:
BDBM50085680
Synonyms:
4-(6,7-Dihydro-benzo[b]thiophen-4-yl)-1H-imidazole | CHEMBL286246
Type:
Small organic molecule
Emp. Form.:
C11H10N2S
Mol. Mass.:
202.276
SMILES:
C1Cc2sccc2C(=C1)c1cnc[nH]1
: