Target
B2 bradykinin receptor
Ligand
BDBM50085685
Substrate
Meas. Tech.
ChEMBL_40443 (CHEMBL652382)
Ki
1.8±n/a nM
Citation
 Dziadulewicz, EKRitchie, TJHallett, ASnell, CRKo, SYWrigglesworth, RHughes, GADunstan, ARBloomfield, GCDrake, GSBrown, MCLee, WBurgess, GMDavis, CYaqoob, MPerkins, MNCampbell, EADavis, AJRang, HP 1-(2-Nitrophenyl)thiosemicarbazides: a novel class of potent, orally active non-peptide antagonist for the bradykinin B(2) receptor. J Med Chem 43:769-71 (2000)  
Target
Name:
B2 bradykinin receptor
Synonyms:
B2 BRADYKININ B2R BKRB2_RAT Bradykinin B2 receptor
Type:
Enzyme Catalytic Domain
Mol. Mass.:
44941.22
Organism:
RAT
Description:
B2 BRADYKININ BDKRB2 RAT::P25023
Residue:
396
  
Inhibitor
Name:
BDBM50085685
Synonyms:
4-benzhydrylamino(thioxo)methylhydrazine-3-nitrobenzamide | CHEMBL349817
Type:
Small organic molecule
Emp. Form.:
C21H19N5O3S
Mol. Mass.:
421.472
SMILES:
NC(=O)c1ccc(N[N-]C(=[SH+])NC(c2ccccc2)c2ccccc2)c(c1)[N+]([O-])=O
: