Target
5-hydroxytryptamine receptor 1E
Ligand
BDBM50085970
Substrate
Meas. Tech.
ChEMBL_2053 (CHEMBL872911)
Ki
>10000±n/a nM
Citation
 Glennon, RALee, MRangisetty, JBDukat, MRoth, BLSavage, JEMcBride, ARauser, LHufeisen, SLee, DK 2-Substituted tryptamines: agents with selectivity for 5-HT(6) serotonin receptors. J Med Chem 43:1011-8 (2000)  
Target
Name:
5-hydroxytryptamine receptor 1E
Synonyms:
5-HT-1E 5-Hydroxytryptamine Receptor Subtype 1E (5HT1E) 5-hydroxytryptamine receptor 1E (5-HT-1E) (S31) 5HT1E_HUMAN S31 Serotonin 1e (5-HT1e) receptor | Serotonin Receptor 1E
Type:
G Protein-Coupled Receptor (GPCR)
Mol. Mass.:
41697.80
Organism:
Homo sapiens (Human)
Description:
gi_112822
Residue:
365
  
Inhibitor
Name:
BDBM50085970
Synonyms:
CHEMBL7318 [2-(5-Methoxy-2-phenyl-1H-indol-3-yl)-ethyl]-dimethyl-amine (C2H2O4) | [2-(5-methoxy-2-phenyl-1H-indol-3-yl)ethyl]dimethylamine, 5
Type:
Small organic molecule
Emp. Form.:
C19H22N2O
Mol. Mass.:
294.3908
SMILES:
COc1ccc2[nH]c(c(CCN(C)C)c2c1)-c1ccccc1
: