Target
Adenosine receptor A2a
Ligand
BDBM50086140
Substrate
Meas. Tech.
ChEMBL_31053 (CHEMBL642124)
Ki
1370±n/a nM
Citation
 Colotta, VCatarzi, DVarano, FCecchi, LFilacchioni, GMartini, CTrincavelli, LLucacchini, A 1,2,4-Triazolo[4,3-a]quinoxalin-1-one: a versatile tool for the synthesis of potent and selective adenosine receptor antagonists. J Med Chem 43:1158-64 (2000)  
Target
Name:
Adenosine receptor A2a
Synonyms:
A2A adenosine receptor (hA2A) ADENOSINE A2 ADORA2 Adenosine A2A receptor (A2AAR)
Type:
G Protein-Coupled Receptor (GPCR)
Mol. Mass.:
44716.46
Organism:
Homo sapiens (Human)
Description:
P29274
Residue:
412
  
Inhibitor
Name:
BDBM50086140
Synonyms:
4-(cyclohexylamino)-2-phenyl-[1,2,4]triazolo[4,3-a]quinoxalin-1(2H)-one CHEMBL274267
Type:
Small organic molecule
Emp. Form.:
C21H21N5O
Mol. Mass.:
359.4243
SMILES:
O=c1n(nc2c(NC3CCCCC3)nc3ccccc3n12)-c1ccccc1
: