Target
Adenosine receptor A3
Ligand
BDBM50086140
Substrate
Meas. Tech.
ChEMBL_31868 (CHEMBL644389)
Ki
506.0±n/a nM
Citation
 Colotta, VCatarzi, DVarano, FCecchi, LFilacchioni, GMartini, CTrincavelli, LLucacchini, A 1,2,4-Triazolo[4,3-a]quinoxalin-1-one: a versatile tool for the synthesis of potent and selective adenosine receptor antagonists. J Med Chem 43:1158-64 (2000)  
Target
Name:
Adenosine receptor A3
Synonyms:
A3 adenosine receptor (hA3) ADORA3 | Adenosine A3 receptor (A3AR)
Type:
G Protein-Coupled Receptor (GPCR)
Mol. Mass.:
36197.32
Organism:
Homo sapiens (Human)
Description:
P0DMS8
Residue:
318
  
Inhibitor
Name:
BDBM50086140
Synonyms:
4-(cyclohexylamino)-2-phenyl-[1,2,4]triazolo[4,3-a]quinoxalin-1(2H)-one CHEMBL274267
Type:
Small organic molecule
Emp. Form.:
C21H21N5O
Mol. Mass.:
359.4243
SMILES:
O=c1n(nc2c(NC3CCCCC3)nc3ccccc3n12)-c1ccccc1
: