Target
Adenosine receptor A1
Ligand
BDBM50086163
Substrate
Meas. Tech.
ChEMBL_27592 (CHEMBL644312)
Ki
105±n/a nM
Citation
 Kim, YCJi, XMelman, NLinden, JJacobson, KA Anilide derivatives of an 8-phenylxanthine carboxylic congener are highly potent and selective antagonists at human A(2B) adenosine receptors. J Med Chem 43:1165-72 (2000)  
Target
Name:
Adenosine receptor A1
Synonyms:
A1 adenosine receptor (hA1) AA1R_HUMAN ADORA1 Adenosine A1-receptor Adenosine receptor A1 (hA1) | Adenosine transporter (AdT)
Type:
G Protein-Coupled Receptor (GPCR)
Mol. Mass.:
36520.92
Organism:
Homo sapiens (Human)
Description:
P30542
Residue:
326
  
Inhibitor
Name:
BDBM50086163
Synonyms:
CHEMBL17294 | N-(3,4-Dimethyl-2,5-dioxo-2,5-dihydro-pyrrol-1-yl)-3-[4-(2,6-dioxo-1,3-dipropyl-2,3,6,7-tetrahydro-1H-purin-8-yl)-phenyl]-acrylamide
Type:
Small organic molecule
Emp. Form.:
C26H28N6O5
Mol. Mass.:
504.5377
SMILES:
CCCn1c2nc([nH]c2c(=O)n(CCC)c1=O)-c1ccc(C=CC(=O)NN2C(=O)C(C)=C(C)C2=O)cc1
: