Target
Adenosine receptor A2b
Ligand
BDBM50086174
Substrate
Meas. Tech.
ChEMBL_4794 (CHEMBL618339)
Ki
2.14±n/a nM
Citation
 Kim, YCJi, XMelman, NLinden, JJacobson, KA Anilide derivatives of an 8-phenylxanthine carboxylic congener are highly potent and selective antagonists at human A(2B) adenosine receptors. J Med Chem 43:1165-72 (2000)  
Target
Name:
Adenosine receptor A2b
Synonyms:
AA2BR_HUMAN ADORA2B Adenosine receptors A2b | Adenosine receptors; A2a & A2b
Type:
G Protein-Coupled Receptor (GPCR)
Mol. Mass.:
36341.22
Organism:
Homo sapiens (Human)
Description:
Residue:
332
  
Inhibitor
Name:
BDBM50086174
Synonyms:
2-[4-(2,6-Dioxo-1,3-dipropyl-2,3,6,7-tetrahydro-1H-purin-8-yl)-phenoxy]-N-(4-trifluoromethyl-phenyl)-acetamide | CHEMBL277386
Type:
Small organic molecule
Emp. Form.:
C26H26F3N5O4
Mol. Mass.:
529.5109
SMILES:
CCCn1c2nc([nH]c2c(=O)n(CCC)c1=O)-c1ccc(OCC(=O)Nc2ccc(cc2)C(F)(F)F)cc1
: