Target
Beta-1 adrenergic receptor
Ligand
BDBM50029050
Substrate
Meas. Tech.
ChEMBL_1913979 (CHEMBL4416562)
EC50
290±n/a nM
Citation
 Yang, ELSun, BHuang, ZYLin, JGJiao, BXiang, L Synthesis, Purification, and Selective ? J Nat Prod 82:2986-2993 (2019)  
Target
Name:
Beta-1 adrenergic receptor
Synonyms:
ADRB1 ADRB1_HUMAN Beta-1 adrenoceptor adrenergic Beta1
Type:
G Protein-Coupled Receptor (GPCR)
Mol. Mass.:
51338.40
Organism:
Homo sapiens (Human)
Description:
P08588
Residue:
477
  
Inhibitor
Name:
BDBM50029050
Synonyms:
(-)-(R)-epinephrine (-)-adrenaline (R)-adrenaline Adrenalin EPINEPHRINE levoepinephrine
Type:
Small organic molecule
Emp. Form.:
C9H13NO3
Mol. Mass.:
183.2044
SMILES:
CNC[C@H](O)c1ccc(O)c(O)c1
: