Target
Alpha-1B adrenergic receptor
Ligand
BDBM50029050
Substrate
Meas. Tech.
ChEMBL_1913980 (CHEMBL4416563)
EC50
75.0±n/a nM
Citation
 Yang, ELSun, BHuang, ZYLin, JGJiao, BXiang, L Synthesis, Purification, and Selective ? J Nat Prod 82:2986-2993 (2019)  
Target
Name:
Alpha-1B adrenergic receptor
Synonyms:
ADA1B_HUMAN Adrenergic alpha1B Adrenergic receptor alpha Alpha 1B-adrenoreceptor | Alpha-1B adrenergic receptor
Type:
Enzyme
Mol. Mass.:
56862.13
Organism:
Homo sapiens (Human)
Description:
P35368
Residue:
520
  
Inhibitor
Name:
BDBM50029050
Synonyms:
(-)-(R)-epinephrine (-)-adrenaline (R)-adrenaline Adrenalin EPINEPHRINE levoepinephrine
Type:
Small organic molecule
Emp. Form.:
C9H13NO3
Mol. Mass.:
183.2044
SMILES:
CNC[C@H](O)c1ccc(O)c(O)c1
: