Target
Kappa-type opioid receptor
Ligand
BDBM50086361
Substrate
Meas. Tech.
ChEBML_145264
Ki
1.3±n/a nM
Citation
 Allen, MPBlake, JFBryce, DKHaggan, MELiras, SMcLean, SSegelstein, BE Design, synthesis and biological evaluation of 3-amino-3-phenylpropionamide derivatives as novel mu opioid receptor ligands. Bioorg Med Chem Lett 10:523-6 (2000)  
Target
Name:
Kappa-type opioid receptor
Synonyms:
K-OR-1 Kappa-opioid receptor (KOR) Kappa-type opioid receptor (KOR) OPIATE Kappa OPRK1 kappa opioid receptor (KOR)
Type:
G Protein-Coupled Receptor (GPCR)
Mol. Mass.:
42648.76
Organism:
Homo sapiens (Human)
Description:
P41145
Residue:
380
  
Inhibitor
Name:
BDBM50086361
Synonyms:
3-(3-Hydroxy-phenyl)-2,2-dimethyl-3-methylamino-N-naphthalen-1-ylmethyl-propionamide | CHEMBL151921
Type:
Small organic molecule
Emp. Form.:
C23H26N2O2
Mol. Mass.:
362.4647
SMILES:
CNC(c1cccc(O)c1)C(C)(C)C(=O)NCc1cccc2ccccc12
: