Target
Beta-1 adrenergic receptor
Ligand
BDBM50086673
Substrate
Meas. Tech.
ChEBML_37545
Ki
20±n/a nM
Citation
 Cecchetti, VSchiaffella, FTabarrini, OFravolini, A (1,4-Benzothiazinyloxy)alkylpiperazine derivatives as potential antihypertensive agents. Bioorg Med Chem Lett 10:465-8 (2000)  
Target
Name:
Beta-1 adrenergic receptor
Synonyms:
ADRB1R, B1AR Adrb1 Adrenergic receptor beta Beta-1 adrenoreceptor adrenergic Beta1,2
Type:
Protein
Mol. Mass.:
50486.84
Organism:
Rattus norvegicus (Rat)
Description:
P18090
Residue:
466
  
Inhibitor
Name:
BDBM50086673
Synonyms:
8-(3-tert-Butylamino-2-hydroxy-propoxy)-4H-benzo[1,4]thiazin-3-one | CHEMBL140908
Type:
Small organic molecule
Emp. Form.:
C15H22N2O3S
Mol. Mass.:
310.412
SMILES:
CC(C)(C)NCC(O)COc1cccc2NC(=O)CSc12
: