Target
Beta-1 adrenergic receptor
Ligand
BDBM50086660
Substrate
Meas. Tech.
ChEMBL_37544 (CHEMBL647626)
Ki
>1000±n/a nM
Citation
 Cecchetti, VSchiaffella, FTabarrini, OFravolini, A (1,4-Benzothiazinyloxy)alkylpiperazine derivatives as potential antihypertensive agents. Bioorg Med Chem Lett 10:465-8 (2000)  
Target
Name:
Beta-1 adrenergic receptor
Synonyms:
ADRB1R, B1AR Adrb1 Adrenergic receptor beta Beta-1 adrenoreceptor adrenergic Beta1,2
Type:
Protein
Mol. Mass.:
50486.84
Organism:
Rattus norvegicus (Rat)
Description:
P18090
Residue:
466
  
Inhibitor
Name:
BDBM50086660
Synonyms:
6-{3-[4-(4-Fluoro-benzoyl)-piperazin-1-yl]-2-hydroxy-propoxy}-4H-benzo[1,4]thiazin-3-one | CHEMBL142912
Type:
Small organic molecule
Emp. Form.:
C22H24FN3O4S
Mol. Mass.:
445.507
SMILES:
OC(COc1ccc2SCC(=O)Nc2c1)CN1CCN(CC1)C(=O)c1ccc(F)cc1
: