Target
Beta-1 adrenergic receptor
Ligand
BDBM50086670
Substrate
Meas. Tech.
ChEBML_37545
Ki
330±n/a nM
Citation
 Cecchetti, VSchiaffella, FTabarrini, OFravolini, A (1,4-Benzothiazinyloxy)alkylpiperazine derivatives as potential antihypertensive agents. Bioorg Med Chem Lett 10:465-8 (2000)  
Target
Name:
Beta-1 adrenergic receptor
Synonyms:
ADRB1R, B1AR Adrb1 Adrenergic receptor beta Beta-1 adrenoreceptor adrenergic Beta1,2
Type:
Protein
Mol. Mass.:
50486.84
Organism:
Rattus norvegicus (Rat)
Description:
P18090
Residue:
466
  
Inhibitor
Name:
BDBM50086670
Synonyms:
8-{2-Hydroxy-3-[4-(2-methoxy-phenyl)-piperazin-1-yl]-propoxy}-4H-benzo[1,4]thiazin-3-one | CHEMBL341614
Type:
Small organic molecule
Emp. Form.:
C22H27N3O4S
Mol. Mass.:
429.532
SMILES:
COc1ccccc1N1CCN(CC(O)COc2cccc3NC(=O)CSc23)CC1
: