Target
5-hydroxytryptamine receptor 1A
Ligand
BDBM50086859
Substrate
Meas. Tech.
ChEMBL_1229 (CHEMBL616181)
IC50
>1000±n/a nM
Citation
 Fujio, MTogo, YTomozane, HKuroita, TMorio, YKatayama, JMatsumoto, Y N-[[1-(2-phenylethyl)pyrrolidin-2-yl]methyl]cyclohexanecarboxamides as selective 5-HT1A receptor agonists. Bioorg Med Chem Lett 10:509-12 (2000)  
Target
Name:
5-hydroxytryptamine receptor 1A
Synonyms:
5-HT-1A 5-HT1A 5-hydroxytryptamine receptor 1A (5HT1A) 5ht1a Htr1a Serotonin 1a (5-HT1a) receptor/Adrenergic receptor alpha-1 | Serotonin receptor 1A
Type:
G Protein-Coupled Receptor (GPCR)
Mol. Mass.:
46445.29
Organism:
Rattus norvegicus (rat)
Description:
Binding assays were performed using rat hippocampal membranes.
Residue:
422
  
Inhibitor
Name:
BDBM50086859
Synonyms:
CHEMBL147226 | N-((R)-1-Phenethyl-pyrrolidin-2-ylmethyl)-benzamide
Type:
Small organic molecule
Emp. Form.:
C20H24N2O
Mol. Mass.:
308.4174
SMILES:
O=C(NC[C@H]1CCCN1CCc1ccccc1)c1ccccc1
: