Target
Ephrin type-B receptor 4
Ligand
BDBM50531754
Substrate
Meas. Tech.
ChEMBL_1920865 (CHEMBL4423710)
IC50
0.320000±n/a nM
Citation
 Shan, YSi, RWang, JZhang, QZhou, HSong, JZhang, JChen, Q Discovery of novel anti-angiogenesis agents. Part 9: Multiplex inhibitors suppressing compensatory activations of RTKs. Eur J Med Chem 164:440-447 (2019)  
Target
Name:
Ephrin type-B receptor 4
Synonyms:
EPHB4 Ephrin receptor HTK MYK1 Tyrosine-protein kinase TYRO11 | VHL/Ephrin type-B receptor 4
Type:
Enzyme
Mol. Mass.:
108273.51
Organism:
Homo sapiens (Human)
Description:
P54760
Residue:
987
  
Inhibitor
Name:
BDBM50531754
Synonyms:
CHEMBL4456738
Type:
Small organic molecule
Emp. Form.:
C19H15N5
Mol. Mass.:
313.3559
SMILES:
C(c1ccc(cc1)-c1cncnc1)n1cc(nn1)-c1ccccc1
: