Target
Ephrin type-B receptor 4
Ligand
BDBM50531752
Substrate
Meas. Tech.
ChEMBL_1920865 (CHEMBL4423710)
IC50
2.2±n/a nM
Citation
 Shan, YSi, RWang, JZhang, QZhou, HSong, JZhang, JChen, Q Discovery of novel anti-angiogenesis agents. Part 9: Multiplex inhibitors suppressing compensatory activations of RTKs. Eur J Med Chem 164:440-447 (2019)  
Target
Name:
Ephrin type-B receptor 4
Synonyms:
EPHB4 Ephrin receptor HTK MYK1 Tyrosine-protein kinase TYRO11 | VHL/Ephrin type-B receptor 4
Type:
Enzyme
Mol. Mass.:
108273.51
Organism:
Homo sapiens (Human)
Description:
P54760
Residue:
987
  
Inhibitor
Name:
BDBM50531752
Synonyms:
CHEMBL4525897
Type:
Small organic molecule
Emp. Form.:
C20H16F3N5
Mol. Mass.:
383.3697
SMILES:
Cn1cc(cn1)-c1ccc(Cn2cc(nn2)-c2ccc(cc2)C(F)(F)F)cc1
: