Target
Oxytocin receptor
Ligand
BDBM50056796
Substrate
Meas. Tech.
ChEMBL_220998 (CHEMBL821744)
Ki
3.2±n/a nM
Citation
 Bélec, LSlaninova, JLubell, WD A study of the relationship between biological activity and prolyl amide isomer geometry in oxytocin using 5-tert-butylproline to augment the Cys(6)-Pro(7) amide cis-isomer population. J Med Chem 43:1448-55 (2000)  
Target
Name:
Oxytocin receptor
Synonyms:
OT-R Otr Oxytocin
Type:
Enzyme Catalytic Domain
Mol. Mass.:
42889.28
Organism:
RAT
Description:
Oxytocin OXTR RAT::P70536
Residue:
388
  
Inhibitor
Name:
BDBM50056796
Synonyms:
CHEMBL435716 | DEAMINOOXYTOCIN
Type:
Small organic molecule
Emp. Form.:
C43H65N11O12S2
Mol. Mass.:
992.173
SMILES:
CC[C@H](C)[C@@H]1NC(=O)[C@H](Cc2ccc(O)cc2)NC(=O)CCSSC[C@@H](NC(=O)[C@H](CC(N)=O)NC(=O)[C@H](CCC(N)=O)NC1=O)C(=O)N1CCC[C@H]1C(=O)N[C@@H](CC(C)C)C(=O)NCC(N)=O
: