Target
AMP deaminase 2
Ligand
BDBM50087310
Substrate
Meas. Tech.
ChEMBL_28868 (CHEMBL644200)
Ki
1700±n/a nM
Citation
 Bookser, BCKasibhatla, SRAppleman, JRErion, MD AMP deaminase inhibitors. 2. Initial discovery of a non-nucleotide transition-state inhibitor series. J Med Chem 43:1495-507 (2000)  
Target
Name:
AMP deaminase 2
Synonyms:
AMP deaminase 2 AMPD2 | AMPD2_HUMAN
Type:
Protein
Mol. Mass.:
100694.77
Organism:
Homo sapiens (Human)
Description:
Residue:
879
  
Inhibitor
Name:
BDBM50087310
Synonyms:
2-(4-Chloro-benzyl)-6-(8-hydroxy-7,8-dihydro-6H-imidazo[4,5-d][1,3]diazepin-3-yl)-hexanoic acid H2O.0.25CH3CO2H | CHEMBL37142
Type:
Small organic molecule
Emp. Form.:
C19H23ClN4O3
Mol. Mass.:
390.864
SMILES:
OC1CNC=Nc2c1ncn2CCCCC(Cc1ccc(Cl)cc1)C(O)=O
: