Target
AMP deaminase 2
Ligand
BDBM50087321
Substrate
Meas. Tech.
ChEMBL_28868 (CHEMBL644200)
Ki
970±n/a nM
Citation
 Bookser, BCKasibhatla, SRAppleman, JRErion, MD AMP deaminase inhibitors. 2. Initial discovery of a non-nucleotide transition-state inhibitor series. J Med Chem 43:1495-507 (2000)  
Target
Name:
AMP deaminase 2
Synonyms:
AMP deaminase 2 AMPD2 | AMPD2_HUMAN
Type:
Protein
Mol. Mass.:
100694.77
Organism:
Homo sapiens (Human)
Description:
Residue:
879
  
Inhibitor
Name:
BDBM50087321
Synonyms:
2-[4-(8-Hydroxy-7,8-dihydro-6H-imidazo[4,5-d][1,3]diazepin-3-yl)-butyl]-indan-2-carboxylic acid 1H2O | CHEMBL37713
Type:
Small organic molecule
Emp. Form.:
C20H24N4O3
Mol. Mass.:
368.4296
SMILES:
OC1CNC=Nc2c1ncn2CCCCC1(Cc2ccccc2C1)C(O)=O
: