Target
AMP deaminase 2
Ligand
BDBM50087297
Substrate
Meas. Tech.
ChEMBL_28868 (CHEMBL644200)
Ki
>125000±n/a nM
Citation
 Bookser, BCKasibhatla, SRAppleman, JRErion, MD AMP deaminase inhibitors. 2. Initial discovery of a non-nucleotide transition-state inhibitor series. J Med Chem 43:1495-507 (2000)  
Target
Name:
AMP deaminase 2
Synonyms:
AMP deaminase 2 AMPD2 | AMPD2_HUMAN
Type:
Protein
Mol. Mass.:
100694.77
Organism:
Homo sapiens (Human)
Description:
Residue:
879
  
Inhibitor
Name:
BDBM50087297
Synonyms:
3-Benzyl-3,6,7,8-tetrahydro-imidazo[4,5-d][1,3]diazepin-8-ol | CHEMBL37640
Type:
Small organic molecule
Emp. Form.:
C13H14N4O
Mol. Mass.:
242.2765
SMILES:
OC1CNC=Nc2c1ncn2Cc1ccccc1
: