Target
AMP deaminase 3
Ligand
BDBM50087408
Substrate
Meas. Tech.
ChEMBL_28867 (CHEMBL644199)
Ki
250±n/a nM
Citation
 Bookser, BCKasibhatla, SRErion, MD AMP deaminase inhibitors. 4. Further N3-substituted coformycin aglycon analogues: N3-alkylmalonates as ribose 5'-monophosphate mimetics. J Med Chem 43:1519-24 (2000)  
Target
Name:
AMP deaminase 3
Synonyms:
AMP deaminase 3 AMPD3 | AMPD3_HUMAN
Type:
Protein
Mol. Mass.:
88818.80
Organism:
Homo sapiens (Human)
Description:
Residue:
767
  
Inhibitor
Name:
BDBM50087408
Synonyms:
2-[4-(8-Hydroxy-7,8-dihydro-6H-imidazo[4,5-d][1,3]diazepin-3-yl)-butyl]-2-(2-trifluoromethyl-benzyl)-malonic acid dibenzyl ester | CHEMBL37079
Type:
Small organic molecule
Emp. Form.:
C35H35F3N4O5
Mol. Mass.:
648.6714
SMILES:
OC1CNC=Nc2c1ncn2CCCCC(Cc1ccccc1C(F)(F)F)(C(=O)OCc1ccccc1)C(=O)OCc1ccccc1
: