Target
AMP deaminase 3
Ligand
BDBM50087418
Substrate
Meas. Tech.
ChEMBL_28867 (CHEMBL644199)
Ki
2100±n/a nM
Citation
 Bookser, BCKasibhatla, SRErion, MD AMP deaminase inhibitors. 4. Further N3-substituted coformycin aglycon analogues: N3-alkylmalonates as ribose 5'-monophosphate mimetics. J Med Chem 43:1519-24 (2000)  
Target
Name:
AMP deaminase 3
Synonyms:
AMP deaminase 3 AMPD3 | AMPD3_HUMAN
Type:
Protein
Mol. Mass.:
88818.80
Organism:
Homo sapiens (Human)
Description:
Residue:
767
  
Inhibitor
Name:
BDBM50087418
Synonyms:
6-(8-Hydroxy-7,8-dihydro-6H-imidazo[4,5-d][1,3]diazepin-3-yl)-2-methyl-2-phenethylcarbamoyl-hexanoic acid 0.75H2O.0.3CH3CO2H | CHEMBL287822
Type:
Small organic molecule
Emp. Form.:
C22H29N5O4
Mol. Mass.:
427.4968
SMILES:
CC(CCCCn1cnc2C(O)CNC=Nc12)(C(O)=O)C(=O)NCCc1ccccc1
: