Target
AMP deaminase 3
Ligand
BDBM50087417
Substrate
Meas. Tech.
ChEMBL_28867 (CHEMBL644199)
Ki
1300±n/a nM
Citation
 Bookser, BCKasibhatla, SRErion, MD AMP deaminase inhibitors. 4. Further N3-substituted coformycin aglycon analogues: N3-alkylmalonates as ribose 5'-monophosphate mimetics. J Med Chem 43:1519-24 (2000)  
Target
Name:
AMP deaminase 3
Synonyms:
AMP deaminase 3 AMPD3 | AMPD3_HUMAN
Type:
Protein
Mol. Mass.:
88818.80
Organism:
Homo sapiens (Human)
Description:
Residue:
767
  
Inhibitor
Name:
BDBM50087417
Synonyms:
2-(4-Chloro-benzylcarbamoyl)-6-(8-hydroxy-7,8-dihydro-6H-imidazo[4,5-d][1,3]diazepin-3-yl)-hexanoic acid 1H2O.025CH3CO2H | CHEMBL37650
Type:
Small organic molecule
Emp. Form.:
C20H24ClN5O4
Mol. Mass.:
433.889
SMILES:
OC1CNC=Nc2c1ncn2CCCCC(C(O)=O)C(=O)NCc1ccc(Cl)cc1
: