Target
Alpha-1B adrenergic receptor
Ligand
BDBM50087468
Substrate
Meas. Tech.
ChEMBL_34312 (CHEMBL648097)
Ki
6.34±n/a nM
Citation
 Meyer, MDAltenbach, RJBasha, FZCarroll, WACondon, SElmore, SWKerwin, JFSippy, KBTietje, KWendt, MDHancock, AABrune, MEBuckner, SADrizin, I Structure-activity studies for a novel series of tricyclic substituted hexahydrobenz[e]isoindole alpha(1A) adrenoceptor antagonists as potential agents for the symptomatic treatment of benign prostatic hyperplasia (BPH). J Med Chem 43:1586-603 (2000)  
Target
Name:
Alpha-1B adrenergic receptor
Synonyms:
ADA1B_MESAU Adrenergic receptor alpha adrenergic Alpha1B
Type:
Enzyme Catalytic Domain
Mol. Mass.:
56514.13
Organism:
C.H.O.
Description:
adrenergic Alpha1B ADRA1B C.H.O.::P18841
Residue:
515
  
Inhibitor
Name:
BDBM50087468
Synonyms:
3-[2-(6-Methoxy-1,3,3a,4,5,9b-hexahydro-benzo[e]isoindol-2-yl)-ethyl]-2,4-dioxo-1,2,3,4-tetrahydro-benzo[4,5]thieno[3,2-d]pyrimidine-8-carboxylic acid amide | CHEMBL290388
Type:
Small organic molecule
Emp. Form.:
C26H26N4O4S
Mol. Mass.:
490.574
SMILES:
COc1cccc2[C@@H]3CN(CCn4c(=O)[nH]c5c6cc(ccc6sc5c4=O)C(N)=O)C[C@@H]3CCc12
: