Target
Alpha-1B adrenergic receptor
Ligand
BDBM50087472
Substrate
Meas. Tech.
ChEMBL_34312 (CHEMBL648097)
Ki
3±n/a nM
Citation
 Meyer, MDAltenbach, RJBasha, FZCarroll, WACondon, SElmore, SWKerwin, JFSippy, KBTietje, KWendt, MDHancock, AABrune, MEBuckner, SADrizin, I Structure-activity studies for a novel series of tricyclic substituted hexahydrobenz[e]isoindole alpha(1A) adrenoceptor antagonists as potential agents for the symptomatic treatment of benign prostatic hyperplasia (BPH). J Med Chem 43:1586-603 (2000)  
Target
Name:
Alpha-1B adrenergic receptor
Synonyms:
ADA1B_MESAU Adrenergic receptor alpha adrenergic Alpha1B
Type:
Enzyme Catalytic Domain
Mol. Mass.:
56514.13
Organism:
C.H.O.
Description:
adrenergic Alpha1B ADRA1B C.H.O.::P18841
Residue:
515
  
Inhibitor
Name:
BDBM50087472
Synonyms:
6-Methoxy-2-[2-(6-methoxy-1,3,3a,4,5,9b-hexahydro-benzo[e]isoindol-2-yl)-ethyl]-4H-9-thia-2,4,5-triaza-fluorene-1,3-dione | CHEMBL41234
Type:
Small organic molecule
Emp. Form.:
C25H26N4O4S
Mol. Mass.:
478.563
SMILES:
COc1ccc2sc3c([nH]c(=O)n(CCN4C[C@@H]5CCc6c(OC)cccc6[C@@H]5C4)c3=O)c2n1
: