Target
Prothrombin
Ligand
BDBM50079247
Substrate
Meas. Tech.
ChEBML_209232
Ki
5800±n/a nM
Citation
 Pruitt, JRPinto, DJEstrella, MJBostrom, LLKnabb, RMWong, PCWright, MRWexler, RR Isoxazolines and isoxazoles as factor Xa inhibitors. Bioorg Med Chem Lett 10:685-9 (2000)  
Target
Name:
Prothrombin
Synonyms:
Activation peptide fragment 1 Coagulation factor II Prothrombin precursor Thrombin heavy chain | Thrombin light chain
Type:
Protein
Mol. Mass.:
70029.57
Organism:
Homo sapiens (Human)
Description:
P00734
Residue:
622
  
Inhibitor
Name:
BDBM50079247
Synonyms:
3-(3-Carbamimidoyl-phenyl)-5-methyl-4,5-dihydro-isoxazole-5-carboxylic acid (2'-sulfamoyl-biphenyl-4-yl)-amide; TFA CHEMBL7967
Type:
Small organic molecule
Emp. Form.:
C24H23N5O4S
Mol. Mass.:
477.536
SMILES:
CC1(CC(=NO1)c1cccc(c1)C(N)=N)C(=O)Nc1ccc(cc1)-c1ccccc1S(N)(=O)=O
: