Target
Serine protease 1
Ligand
BDBM50087533
Substrate
Meas. Tech.
ChEBML_212523
Ki
21±n/a nM
Citation
 Pruitt, JRPinto, DJEstrella, MJBostrom, LLKnabb, RMWong, PCWright, MRWexler, RR Isoxazolines and isoxazoles as factor Xa inhibitors. Bioorg Med Chem Lett 10:685-9 (2000)  
Target
Name:
Serine protease 1
Synonyms:
Beta-Trypsin PRSS1 TRY1 TRYP1 Trypsin I
Type:
Enzyme
Mol. Mass.:
25790.52
Organism:
Bos taurus (bovine)
Description:
P00760
Residue:
246
  
Inhibitor
Name:
BDBM50087533
Synonyms:
3-(3-Carbamimidoyl-phenyl)-isoxazole-4-carboxylic acid (2'-sulfamoyl-biphenyl-4-yl)-amide CHEMBL153611
Type:
Small organic molecule
Emp. Form.:
C23H19N5O4S
Mol. Mass.:
461.493
SMILES:
NC(=N)c1cccc(c1)-c1nocc1C(=O)Nc1ccc(cc1)-c1ccccc1S(N)(=O)=O
: