Target
Coagulation factor X
Ligand
BDBM50087539
Substrate
Meas. Tech.
ChEBML_48820
Ki
1.8±n/a nM
Citation
 Pruitt, JRPinto, DJEstrella, MJBostrom, LLKnabb, RMWong, PCWright, MRWexler, RR Isoxazolines and isoxazoles as factor Xa inhibitors. Bioorg Med Chem Lett 10:685-9 (2000)  
Target
Name:
Coagulation factor X
Synonyms:
Activated coagulation factor X (FXa) Coagulation factor X precursor F10 Factor X heavy chain Factor Xa Stuart-Prower factor
Type:
Enzyme
Mol. Mass.:
54726.60
Organism:
Homo sapiens (Human)
Description:
Residue:
488
  
Inhibitor
Name:
BDBM50087539
Synonyms:
(4S,5R)-3-(3-Carbamimidoyl-phenyl)-5-methyl-4,5-dihydro-isoxazole-4-carboxylic acid (2'-sulfamoyl-biphenyl-4-yl)-amide | CHEMBL436235
Type:
Small organic molecule
Emp. Form.:
C24H23N5O4S
Mol. Mass.:
477.536
SMILES:
C[C@H]1ON=C([C@@H]1C(=O)Nc1ccc(cc1)-c1ccccc1S(N)(=O)=O)c1cccc(c1)C(N)=N
: