Target
Vasopressin V2 receptor
Ligand
BDBM50087551
Substrate
Meas. Tech.
ChEBML_214703
IC50
1.7±n/a nM
Citation
 Albright, JDDelos Santos, EGDusza, JPChan, PSCoupet, JRu, XMazandarani, H The synthesis and vasopressin (AVP) antagonist activity of a novel series of N-aroyl-2,4,5,6-tetrahydropyrazolo[3,4-d]thieno[3,2-b]azepines. Bioorg Med Chem Lett 10:695-8 (2000)  
Target
Name:
Vasopressin V2 receptor
Synonyms:
ADHR AVPR2 DIR Renal-type arginine vasopressin receptor V2R_HUMAN Vasopressin V2 receptor | Vasopressin receptor
Type:
Receptor
Mol. Mass.:
40295.28
Organism:
Homo sapiens (Human)
Description:
P30518
Residue:
371
  
Inhibitor
Name:
BDBM50087551
Synonyms:
Biphenyl-2-carboxylic acid [3-chloro-4-(4,5-dihydro-2H-9-thia-1,2,6-triaza-cyclopenta[e]azulene-6-carbonyl)-phenyl]-amide | CHEMBL350973
Type:
Small organic molecule
Emp. Form.:
C29H21ClN4O2S
Mol. Mass.:
525.021
SMILES:
Clc1cc(NC(=O)c2ccccc2-c2ccccc2)ccc1C(=O)N1CCc2c[nH]nc2-c2sccc12
: