Target
Integrin alpha-4/beta-1
Ligand
BDBM50087584
Substrate
Meas. Tech.
ChEMBL_214671 (CHEMBL820789)
IC50
590±n/a nM
Citation
 Chen, LTilley, JWHuang, TNMiklowski, DTrilles, RGuthrie, RWLuk, KHanglow, ARowan, KSchwinge, VWolitzky, B N-acyl phenylalanine analogues as potent small molecule VLA-4 antagonists. Bioorg Med Chem Lett 10:725-7 (2000)  
Target
Name:
Integrin alpha-4/beta-1
Synonyms:
Fibronectin receptor beta/Integrin alpha-4 | Integrin alpha-4/beta-1
Type:
Mol. Mass.:
Description:
ASSAY_ID of EBI is 88912
Components:
This complex has 2 components.
Component 1
Name:
Integrin beta-1
Synonyms:
CD_antigen=CD29 Fibronectin receptor beta GPIIA ITGB1 MDF2 | MSK12
Type:
Enzyme
Mol. Mass.:
88400.38
Organism:
Homo sapiens (Human)
Description:
P05556
Residue:
798
  
Component 2
Name:
Integrin alpha-4
Synonyms:
CD49 antigen-like family member D CD49d antigen ITA4_HUMAN Integrin alpha-4 Integrin alpha-IV VLA-4 integrin alpha 4 precursor | integrin alpha-4 precursor
Type:
Membrane Protein
Mol. Mass.:
114897.35
Organism:
Homo sapiens (Human)
Description:
P13612
Residue:
1032
  
Inhibitor
Name:
BDBM50087584
Synonyms:
(S)-2-[(Acridine-9-carbonyl)-amino]-3-(4-pentyloxy-phenyl)-propionic acid | CHEMBL350083
Type:
Small organic molecule
Emp. Form.:
C28H28N2O4
Mol. Mass.:
456.5329
SMILES:
CCCCCOc1ccc(C[C@H](NC(=O)c2c3ccccc3nc3ccccc23)C(O)=O)cc1
: