Target
Amine oxidase [flavin-containing] A
Ligand
BDBM50087791
Substrate
Meas. Tech.
ChEMBL_123446 (CHEMBL731837)
Ki
1.4±n/a nM
Citation
 Morón, JACampillo, MPerez, VUnzeta, MPardo, L Molecular determinants of MAO selectivity in a series of indolylmethylamine derivatives: biological activities, 3D-QSAR/CoMFA analysis, and computational simulation of ligand recognition. J Med Chem 43:1684-91 (2000)  
Target
Name:
Amine oxidase [flavin-containing] A
Synonyms:
AOFA_RAT Amine oxidase [flavin-containing] A Monoamine Oxidase Type A (MAO-A) Monoamine oxidase A (MAO-A) Monoamine oxidase type A (MAOA)
Type:
Enzyme
Mol. Mass.:
59515.21
Organism:
Rattus norvegicus (rat)
Description:
Residue:
526
  
Inhibitor
Name:
BDBM50087791
Synonyms:
But-2-ynyl-(5-methoxy-1-methyl-1H-indol-2-ylmethyl)-methyl-amine (FA45) | CHEMBL44433
Type:
Small organic molecule
Emp. Form.:
C16H20N2O
Mol. Mass.:
256.3428
SMILES:
COc1ccc2n(C)c(CN(C)CC#CC)cc2c1
: