Target
Matrix metalloproteinase-9
Ligand
BDBM50088065
Substrate
Meas. Tech.
ChEMBL_105390 (CHEMBL710809)
Ki
0.800000±n/a nM
Citation
 Scozzafava, ASupuran, CT Protease inhibitors: synthesis of potent bacterial collagenase and matrix metalloproteinase inhibitors incorporating N-4-nitrobenzylsulfonylglycine hydroxamate moieties. J Med Chem 43:1858-65 (2000)  
Target
Name:
Matrix metalloproteinase-9
Synonyms:
67 kDa matrix metalloproteinase-9 92 kDa gelatinase CLG4B Gelatinase B MMP9 Matrix metalloproteinase 9 (MMP-9) Matrix metalloproteinase-9 (MMP9)
Type:
Enzyme
Mol. Mass.:
78452.28
Organism:
Homo sapiens (Human)
Description:
P14780
Residue:
707
  
Inhibitor
Name:
BDBM50088065
Synonyms:
CHEMBL54054 | N-Hydroxy-2-[(4-nitro-benzyl)-(3-trifluoromethyl-benzenesulfonyl)-amino]-acetamide
Type:
Small organic molecule
Emp. Form.:
C16H14F3N3O6S
Mol. Mass.:
433.359
SMILES:
ONC(=O)CN(Cc1ccc(cc1)[N+]([O-])=O)S(=O)(=O)c1cccc(c1)C(F)(F)F
: