Target
Thymidylate synthase
Ligand
BDBM50408873
Substrate
Meas. Tech.
ChEMBL_209987 (CHEMBL821415)
Ki
2.4±n/a nM
Citation
 Bavetsias, VMarriott, JHMelin, CKimbell, RMatusiak, ZSBoyle, FTJackman, AL Design and synthesis of Cyclopenta[g]quinazoline-based antifolates as inhibitors of thymidylate synthase and potential antitumor agents(,). J Med Chem 43:1910-26 (2000)  
Target
Name:
Thymidylate synthase
Synonyms:
TS TYSY_MOUSE | Tyms
Type:
PROTEIN
Mol. Mass.:
34957.15
Organism:
Mus musculus
Description:
ChEMBL_1340097
Residue:
307
  
Inhibitor
Name:
BDBM50408873
Synonyms:
CHEMBL292920
Type:
Small organic molecule
Emp. Form.:
C29H28N8O6
Mol. Mass.:
584.5826
SMILES:
Cc1nc2cc3CCC(N(CC#C)c4ccc(cc4)C(=O)N[C@@H](CCc4nnnn4CC(O)=O)C(O)=O)c3cc2c(=O)[nH]1
: