Target
Thymidylate synthase
Ligand
BDBM50088157
Substrate
Meas. Tech.
ChEMBL_209985 (CHEMBL821413)
Ki
2.2±n/a nM
Citation
 Bavetsias, VMarriott, JHMelin, CKimbell, RMatusiak, ZSBoyle, FTJackman, AL Design and synthesis of Cyclopenta[g]quinazoline-based antifolates as inhibitors of thymidylate synthase and potential antitumor agents(,). J Med Chem 43:1910-26 (2000)  
Target
Name:
Thymidylate synthase
Synonyms:
TS TYSY_MOUSE | Tyms
Type:
PROTEIN
Mol. Mass.:
34957.15
Organism:
Mus musculus
Description:
ChEMBL_1340097
Residue:
307
  
Inhibitor
Name:
BDBM50088157
Synonyms:
2-{4-[(2-Methyl-4-oxo-4,6,7,8-tetrahydro-3H-cyclopenta[g]quinazolin-6-yl)-prop-2-ynyl-amino]-benzoylamino}-4-[1-(1H-tetrazol-5-yl)-ethylcarbamoyl]-butyric acid | CHEMBL59261
Type:
Small organic molecule
Emp. Form.:
C30H31N9O5
Mol. Mass.:
597.6244
SMILES:
C[C@@H](NC(=O)CC[C@H](NC(=O)c1ccc(cc1)N(CC#C)C1CCc2cc3nc(C)[nH]c(=O)c3cc12)C(O)=O)c1nnn[nH]1
: