Target
Thymidylate synthase
Ligand
BDBM50088169
Substrate
Meas. Tech.
ChEMBL_209985 (CHEMBL821413)
Ki
2.4±n/a nM
Citation
 Bavetsias, VMarriott, JHMelin, CKimbell, RMatusiak, ZSBoyle, FTJackman, AL Design and synthesis of Cyclopenta[g]quinazoline-based antifolates as inhibitors of thymidylate synthase and potential antitumor agents(,). J Med Chem 43:1910-26 (2000)  
Target
Name:
Thymidylate synthase
Synonyms:
TS TYSY_MOUSE | Tyms
Type:
PROTEIN
Mol. Mass.:
34957.15
Organism:
Mus musculus
Description:
ChEMBL_1340097
Residue:
307
  
Inhibitor
Name:
BDBM50088169
Synonyms:
4-(2-Benzenesulfonylamino-1-methyl-2-oxo-ethylcarbamoyl)-2-{4-[(2-methyl-4-oxo-4,6,7,8-tetrahydro-3H-cyclopenta[g]quinazolin-6-yl)-prop-2-ynyl-amino]-benzoylamino}-butyric acid | CHEMBL57269
Type:
Small organic molecule
Emp. Form.:
C36H36N6O8S
Mol. Mass.:
712.771
SMILES:
C[C@@H](NC(=O)CC[C@H](NC(=O)c1ccc(cc1)N(CC#C)C1CCc2cc3nc(C)[nH]c(=O)c3cc12)C(O)=O)C(=O)NS(=O)(=O)c1ccccc1
: