Target
Glutamate receptor ionotropic, kainate 2
Ligand
BDBM50088211
Substrate
Meas. Tech.
ChEMBL_90582 (CHEMBL701166)
Ki
1404±n/a nM
Citation
 Pedregal, CCollado, IEscribano, AEzquerra, JDomínguez, CMateo, AIRubio, ABaker, SRGoldsworthy, JKamboj, RKBallyk, BAHoo, KBleakman, D 4-Alkyl- and 4-cinnamylglutamic acid analogues are potent GluR5 kainate receptor agonists. J Med Chem 43:1958-68 (2000)  
Target
Name:
Glutamate receptor ionotropic, kainate 2
Synonyms:
EAA4 GLUR6 GRIK2_HUMAN GluR-6 Glutamate receptor 6 Glutamate receptor, ionotropic kainate 2 Glutamate-Kainate, GluR6
Type:
Enzyme Catalytic Domain
Mol. Mass.:
102592.78
Organism:
Homo sapiens (Human)
Description:
Q13002
Residue:
908
  
Inhibitor
Name:
BDBM50088211
Synonyms:
CHEMBL293548 | E-2-Amino-4-[3-(2-chloro-phenyl)-allyl]-pentanedioic acid
Type:
Small organic molecule
Emp. Form.:
C14H16ClNO4
Mol. Mass.:
297.734
SMILES:
N[C@@H](C[C@@H](C\C=C\c1ccccc1Cl)C(O)=O)C(O)=O
: