Target
Glutamate receptor 1
Ligand
BDBM26431
Substrate
Meas. Tech.
ChEMBL_90143 (CHEMBL701241)
Ki
1362±n/a nM
Citation
 Pedregal, CCollado, IEscribano, AEzquerra, JDomínguez, CMateo, AIRubio, ABaker, SRGoldsworthy, JKamboj, RKBallyk, BAHoo, KBleakman, D 4-Alkyl- and 4-cinnamylglutamic acid analogues are potent GluR5 kainate receptor agonists. J Med Chem 43:1958-68 (2000)  
Target
Name:
Glutamate receptor 1
Synonyms:
AMPA-selective glutamate receptor 1 GLUR1 GRIA1_HUMAN GluR-A Glutamate AMPA 1 Glutamate receptor AMPA 1/2 Glutamate receptor ionotropic, AMPA 1
Type:
Enzyme Catalytic Domain
Mol. Mass.:
101512.92
Organism:
Homo sapiens (Human)
Description:
Glutamate AMPA 1 GRIA1 HUMAN::P42261
Residue:
906
  
Inhibitor
Name:
BDBM26431
Synonyms:
(2R)-2-aminopentanedioic acid D-Glu D-[14C]Glu
Type:
radiolabeled amino acid
Emp. Form.:
C5H9NO4
Mol. Mass.:
147.1293
SMILES:
N[C@H](CCC(O)=O)C(O)=O
: