Target
Mu-type opioid receptor
Ligand
BDBM50088369
Substrate
Meas. Tech.
ChEMBL_148997 (CHEMBL757981)
Ki
36.6±n/a nM
Citation
 Vianello, PAlbinati, APinna, GALavecchia, AMarinelli, LBorea, PAGessi, SFadda, PTronci, SCignarella, G Synthesis, molecular modeling, and opioid receptor affinity of 9, 10-diazatricyclo[4.2.1.1(2,5)]decanes and 2,7-diazatricyclo[4.4.0. 0(3,8)]decanes structurally related to 3,8-diazabicyclo[3.2. 1]octanes. J Med Chem 43:2115-23 (2000)  
Target
Name:
Mu-type opioid receptor
Synonyms:
MOR-1 Mu-type opioid receptor (MOR) OPRM_RAT Opioid receptor B Ror-b
Type:
G Protein-Coupled Receptor (GPCR)
Mol. Mass.:
44503.11
Organism:
Rattus norvegicus (rat)
Description:
Competition binding assays were carried out using membrane preparations from transfected HN9.10 cells that constitutively expressed the mu opioid receptor.
Residue:
398
  
Inhibitor
Name:
BDBM50088369
Synonyms:
1-{10-[3-(3-Chloro-phenyl)-allyl]-9,10-diaza-tricyclo[4.2.1.1*2,5*]dec-9-yl}-propan-1-one | CHEMBL303404
Type:
Small organic molecule
Emp. Form.:
C20H25ClN2O
Mol. Mass.:
344.878
SMILES:
CCC(=O)N1C2CC[C@H]1[C@@H]1CCC2N1C\C=C\c1cccc(Cl)c1
: