Target
D(2) dopamine receptor
Ligand
BDBM50088394
Substrate
Meas. Tech.
ChEMBL_61811 (CHEMBL672575)
Ki
25±n/a nM
Citation
 Kuo, GHProuty, CMurray, WVPulito, VJolliffe, LCheung, PVarga, SEvangelisto, MWang, J Design, synthesis, and structure-activity relationships of phthalimide-phenylpiperazines: a novel series of potent and selective alpha(1)(a)-adrenergic receptor antagonists. J Med Chem 43:2183-95 (2000)  
Target
Name:
D(2) dopamine receptor
Synonyms:
D(2) dopamine receptor DOPAMINE D2 Long DRD2 Dopamine D2 receptor Dopamine D2 receptor (D2R) Dopamine2-like | d2
Type:
Cell-surface receptors
Mol. Mass.:
50647.10
Organism:
Homo sapiens (Human)
Description:
P14416
Residue:
443
  
Inhibitor
Name:
BDBM50088394
Synonyms:
2-(4-Dimethylamino-phenyl)-1,3-dioxo-2,3-dihydro-1H-isoindole-5-carboxylic acid {2-hydroxy-3-[4-(2-isopropoxy-phenyl)-piperazin-1-yl]-propyl}-amide | CHEMBL309106
Type:
Small organic molecule
Emp. Form.:
C33H39N5O5
Mol. Mass.:
585.6933
SMILES:
CC(C)Oc1ccccc1N1CCN(C[C@@H](O)CNC(=O)c2ccc3C(=O)N(C(=O)c3c2)c2ccc(cc2)N(C)C)CC1
: