Target
D(3) dopamine receptor
Ligand
BDBM50060964
Substrate
Meas. Tech.
ChEMBL_62264 (CHEMBL675666)
Ki
0.28±n/a nM
Citation
 Kuo, GHProuty, CMurray, WVPulito, VJolliffe, LCheung, PVarga, SEvangelisto, MWang, J Design, synthesis, and structure-activity relationships of phthalimide-phenylpiperazines: a novel series of potent and selective alpha(1)(a)-adrenergic receptor antagonists. J Med Chem 43:2183-95 (2000)  
Target
Name:
D(3) dopamine receptor
Synonyms:
DOPAMINE D3 DRD3_HUMAN Dopamine D3 receptor (D3) Dopamine receptor Dopamine receptor D3
Type:
Mol. Mass.:
44243.43
Organism:
Homo sapiens (Human)
Description:
Residue:
400
  
Inhibitor
Name:
BDBM50060964
Synonyms:
(R)-5-(2-((2-(2-ethoxyphenoxy)ethyl)amino)propyl)-2-methoxybenzenesulfonamide 5-[2-[2-(2-ethoxyphenoxy)ethylamino]propyl]-2-methoxy-benzenesulfonamide TAMSULOSIN
Type:
Small organic molecule
Emp. Form.:
C20H28N2O5S
Mol. Mass.:
408.512
SMILES:
CCOc1ccccc1OCCN[C@H](C)Cc1ccc(OC)c(c1)S(N)(=O)=O
: