Target
Alpha-1B adrenergic receptor
Ligand
BDBM50088405
Substrate
Meas. Tech.
ChEMBL_34335 (CHEMBL648995)
Ki
>2000±n/a nM
Citation
 Kuo, GHProuty, CMurray, WVPulito, VJolliffe, LCheung, PVarga, SEvangelisto, MWang, J Design, synthesis, and structure-activity relationships of phthalimide-phenylpiperazines: a novel series of potent and selective alpha(1)(a)-adrenergic receptor antagonists. J Med Chem 43:2183-95 (2000)  
Target
Name:
Alpha-1B adrenergic receptor
Synonyms:
ADA1B_HUMAN Adrenergic alpha1B Adrenergic receptor alpha Alpha 1B-adrenoreceptor | Alpha-1B adrenergic receptor
Type:
Enzyme
Mol. Mass.:
56862.13
Organism:
Homo sapiens (Human)
Description:
P35368
Residue:
520
  
Inhibitor
Name:
BDBM50088405
Synonyms:
1,3-Dioxo-2-p-tolyl-2,3-dihydro-1H-isoindole-5-carboxylic acid {3-[4-(2-isopropoxy-phenyl)-piperazin-1-yl]-propyl}-amide | CHEMBL304132
Type:
Small organic molecule
Emp. Form.:
C32H36N4O4
Mol. Mass.:
540.6526
SMILES:
CC(C)Oc1ccccc1N1CCN(CCCNC(=O)c2ccc3C(=O)N(C(=O)c3c2)c2ccc(C)cc2)CC1
: