Target
Alpha-2B adrenergic receptor
Ligand
BDBM50088394
Substrate
Meas. Tech.
ChEMBL_33500 (CHEMBL646999)
Ki
169±n/a nM
Citation
 Kuo, GHProuty, CMurray, WVPulito, VJolliffe, LCheung, PVarga, SEvangelisto, MWang, J Design, synthesis, and structure-activity relationships of phthalimide-phenylpiperazines: a novel series of potent and selective alpha(1)(a)-adrenergic receptor antagonists. J Med Chem 43:2183-95 (2000)  
Target
Name:
Alpha-2B adrenergic receptor
Synonyms:
ADA2B_RAT Adrenergic receptor alpha Alpha-2B adrenergic receptor Alpha-2B adrenoreceptor | adrenergic Alpha2B
Type:
Enzyme Catalytic Domain
Mol. Mass.:
50379.83
Organism:
NEONATAL RAT
Description:
adrenergic Alpha2B ADRA2B NEONATAL RAT::P19328
Residue:
453
  
Inhibitor
Name:
BDBM50088394
Synonyms:
2-(4-Dimethylamino-phenyl)-1,3-dioxo-2,3-dihydro-1H-isoindole-5-carboxylic acid {2-hydroxy-3-[4-(2-isopropoxy-phenyl)-piperazin-1-yl]-propyl}-amide | CHEMBL309106
Type:
Small organic molecule
Emp. Form.:
C33H39N5O5
Mol. Mass.:
585.6933
SMILES:
CC(C)Oc1ccccc1N1CCN(C[C@@H](O)CNC(=O)c2ccc3C(=O)N(C(=O)c3c2)c2ccc(cc2)N(C)C)CC1
: