Target
Prothrombin
Ligand
BDBM50088653
Substrate
Meas. Tech.
ChEBML_209048
Ki
0.084000±n/a nM
Citation
 Coburn, CARush, DMWilliams, PDHomnick, CLyle, EALewis, SDLucas, BJDi Muzio-Mower, JMJuliano, MKrueger, JAVastag, KChen, IWVacca, JP Bicyclic pyridones as potent, efficacious and orally bioavailable thrombin inhibitors. Bioorg Med Chem Lett 10:1069-72 (2000)  
Target
Name:
Prothrombin
Synonyms:
Activation peptide fragment 1 Coagulation factor II Prothrombin precursor Thrombin heavy chain | Thrombin light chain
Type:
Protein
Mol. Mass.:
70029.57
Organism:
Homo sapiens (Human)
Description:
P00734
Residue:
622
  
Inhibitor
Name:
BDBM50088653
Synonyms:
CHEMBL274152 | N-(6-Amino-2-methyl-pyridin-3-ylmethyl)-2-((R)-3-cyclobutylmethyl-6-methyl-2,8-dioxo-2,3,4,8-tetrahydro-1H-[1,7]naphthyridin-7-yl)-acetamide
Type:
Small organic molecule
Emp. Form.:
C23H29N5O3
Mol. Mass.:
423.5081
SMILES:
Cc1cc2C[C@@H](CC3CCC3)C(=O)Nc2c(=O)n1CC(=O)NCc1ccc(N)nc1C
: