Target
Mu-type opioid receptor
Ligand
BDBM50088735
Substrate
Meas. Tech.
ChEBML_148989
Ki
1400±n/a nM
Citation
 Boyd, RECarson, JRCodd, EEGauthier, ADNeilson, LAZhang, SP Synthesis and binding affinities of 4-diarylaminotropanes, a new class of delta opioid agonists. Bioorg Med Chem Lett 10:1109-11 (2000)  
Target
Name:
Mu-type opioid receptor
Synonyms:
MOR-1 Mu-type opioid receptor (MOR) OPRM_RAT Opioid receptor B Ror-b
Type:
G Protein-Coupled Receptor (GPCR)
Mol. Mass.:
44503.11
Organism:
Rattus norvegicus (rat)
Description:
Competition binding assays were carried out using membrane preparations from transfected HN9.10 cells that constitutively expressed the mu opioid receptor.
Residue:
398
  
Inhibitor
Name:
BDBM50088735
Synonyms:
CHEMBL12828 | {4-[((1R,3S,5S)-8-Methyl-8-aza-bicyclo[3.2.1]oct-3-yl)-phenyl-amino]-phenyl}-pyrrolidin-1-yl-methanone
Type:
Small organic molecule
Emp. Form.:
C25H31N3O
Mol. Mass.:
389.5331
SMILES:
CN1[C@H]2CC[C@@H]1C[C@H](C2)N(c1ccccc1)c1ccc(cc1)C(=O)N1CCCC1
: